Target
Alpha-1D adrenergic receptor
Ligand
BDBM50090018
Substrate
Meas. Tech.
ChEMBL_32450 (CHEMBL643398)
Ki
160±n/a nM
Citation
 Barrow, JCNantermet, PGSelnick, HGGlass, KLRittle, KEGilbert, KFSteele, TGHomnick, CFFreidinger, RMRansom, RWKling, PReiss, DBroten, TPSchorn, TWChang, RSO'Malley, SSOlah, TVEllis, JDBarrish, AKassahun, KLeppert, PNagarathnam, DForray, C In vitro and in vivo evaluation of dihydropyrimidinone C-5 amides as potent and selective alpha(1A) receptor antagonists for the treatment of benign prostatic hyperplasia. J Med Chem 43:2703-18 (2000)  
Target
Name:
Alpha-1D adrenergic receptor
Synonyms:
ADA1D_HUMAN ADRA1D Adrenergic receptor alpha Alpha 1D-adrenoreceptor Alpha-1D adrenoceptor adrenergic Alpha1D
Type:
Enzyme Catalytic Domain
Mol. Mass.:
60485.82
Organism:
Homo sapiens (Human)
Description:
adrenergic Alpha1D ADRA1D HUMAN::P25100
Residue:
572
  
Inhibitor
Name:
BDBM50090018
Synonyms:
4-(3,4-Difluoro-phenyl)-2-oxo-1,2,3,4-tetrahydro-pyrimidine-5-carboxylic acid {3-[4-(2-cyano-phenyl)-piperidin-1-yl]-propyl}-amide | CHEMBL90652
Type:
Small organic molecule
Emp. Form.:
C26H27F2N5O2
Mol. Mass.:
479.5217
SMILES:
Fc1ccc(cc1F)[C@H]1NC(=O)N=CC1C(=O)NCCCN1CCC(CC1)c1ccccc1C#N
: