Target
Alpha-1A adrenergic receptor
Ligand
BDBM50090025
Substrate
Meas. Tech.
ChEMBL_33736 (CHEMBL647052)
Ki
0.17±n/a nM
Citation
 Barrow, JCNantermet, PGSelnick, HGGlass, KLRittle, KEGilbert, KFSteele, TGHomnick, CFFreidinger, RMRansom, RWKling, PReiss, DBroten, TPSchorn, TWChang, RSO'Malley, SSOlah, TVEllis, JDBarrish, AKassahun, KLeppert, PNagarathnam, DForray, C In vitro and in vivo evaluation of dihydropyrimidinone C-5 amides as potent and selective alpha(1A) receptor antagonists for the treatment of benign prostatic hyperplasia. J Med Chem 43:2703-18 (2000)  
Target
Name:
Alpha-1A adrenergic receptor
Synonyms:
ADA1A_HUMAN ADRA1C Alpha 1A-adrenoceptor Alpha adrenergic receptor 1a Alpha-adrenergic receptor 1c adrenergic Alpha1 | adrenergic Alpha1C
Type:
Cell-surface receptors
Mol. Mass.:
51511.67
Organism:
Homo sapiens (Human)
Description:
P35348
Residue:
466
  
Inhibitor
Name:
BDBM50090025
Synonyms:
4-(3,4-Difluoro-phenyl)-2-oxo-1,2,3,4-tetrahydro-pyrimidine-5-carboxylic acid {3-[4-cyano-4-(4-fluoro-phenyl)-piperidin-1-yl]-propyl}-amide | CHEMBL316100
Type:
Small organic molecule
Emp. Form.:
C26H26F3N5O2
Mol. Mass.:
497.5121
SMILES:
Fc1ccc(cc1)C1(CCN(CCCNC(=O)C2C=NC(=O)N[C@@H]2c2ccc(F)c(F)c2)CC1)C#N
: