Target
Dipeptidyl peptidase 4
Ligand
BDBM50228403
Substrate
Meas. Tech.
ChEMBL_1928893 (CHEMBL4432069)
Kd
0.006600±n/a nM
Citation
 Schnapp, GKlein, THoevels, YBakker, RANar, H Comparative Analysis of Binding Kinetics and Thermodynamics of Dipeptidyl Peptidase-4 Inhibitors and Their Relationship to Structure. J Med Chem 59:7466-77 (2016)  
Target
Name:
Dipeptidyl peptidase 4
Synonyms:
ADABP Adenosine deaminase complexing protein 2 CD_antigen=CD26 DPP4 DPPIV Dipeptidyl peptidase 4 (DPP IV) Dipeptidyl peptidase 4 (DPP4) Dipeptidyl peptidase 4 membrane form Dipeptidyl peptidase IV Dipeptidyl peptidase IV (DDP-IV) Dipeptidyl peptidase IV membrane form Dipeptidyl peptidase-IV (DPP-4) T-cell activation antigen CD26 | TP103
Type:
Enzyme
Mol. Mass.:
88271.01
Organism:
Homo sapiens (Human)
Description:
P27487
Residue:
766
  
Inhibitor
Name:
BDBM50228403
Synonyms:
(R)-8-(3-aminopiperidin-1-yl)-7-(but-2-ynyl)-3-methyl-1-((4-methylquinazolin-2-yl)methyl)-1H-purine-2,6(3H,7H)-dione CHEMBL237500 US10202383, Example 2(142) US9255098, Linagliptin US9556175, 2(142)
Type:
Small organic molecule
Emp. Form.:
C25H28N8O2
Mol. Mass.:
472.5422
SMILES:
CC#CCn1c(nc2n(C)c(=O)n(Cc3nc(C)c4ccccc4n3)c(=O)c12)N1CCC[C@@H](N)C1
: