Target
Prostaglandin E2 receptor EP3 subtype
Ligand
BDBM50090140
Substrate
Meas. Tech.
ChEMBL_157809 (CHEMBL768757)
EC50
>20000±n/a nM
Citation
 deLong, MAAmburgey, JTaylor, CWos, JASoper, DLWang, YHicks, R Synthesis and in vitro evaluation of human FP-receptor selective prostaglandin analogues. Bioorg Med Chem Lett 10:1519-22 (2000)  
Target
Name:
Prostaglandin E2 receptor EP3 subtype
Synonyms:
PE2R3_HUMAN PGE2-R Prostaglandin E2 receptor Prostaglandin E2 receptor EP3 subtype (EP3) Prostaglandin E2 receptor EP3D subtype (EP3D) | Prostanoid EP3 receptor
Type:
Enzyme
Mol. Mass.:
43335.03
Organism:
Homo sapiens (Human)
Description:
P43115
Residue:
390
  
Inhibitor
Name:
BDBM50090140
Synonyms:
7-{(1R,2R,3R,5S)-3,5-Dihydroxy-2-[(R)-3-hydroxy-5-(3-trifluoromethyl-phenyl)-pentyl]-cyclopentyl}-heptanoic acid | CHEMBL39784
Type:
Small organic molecule
Emp. Form.:
C24H35F3O5
Mol. Mass.:
460.5269
SMILES:
O[C@H](CC[C@H]1[C@H](O)C[C@H](O)[C@@H]1CCCCCCC(O)=O)CCc1cccc(c1)C(F)(F)F
: