Target
Thromboxane A2 receptor
Ligand
BDBM50090140
Substrate
Meas. Tech.
ChEBML_210261
IC50
>10000±n/a nM
Citation
 deLong, MAAmburgey, JTaylor, CWos, JASoper, DLWang, YHicks, R Synthesis and in vitro evaluation of human FP-receptor selective prostaglandin analogues. Bioorg Med Chem Lett 10:1519-22 (2000)  
Target
Name:
Thromboxane A2 receptor
Synonyms:
Prostanoid TP receptor TBXA2R Thromboxane Thromboxane Beta
Type:
Enyzme
Mol. Mass.:
37445.28
Organism:
Homo sapiens (Human)
Description:
P21731
Residue:
343
  
Inhibitor
Name:
BDBM50090140
Synonyms:
7-{(1R,2R,3R,5S)-3,5-Dihydroxy-2-[(R)-3-hydroxy-5-(3-trifluoromethyl-phenyl)-pentyl]-cyclopentyl}-heptanoic acid | CHEMBL39784
Type:
Small organic molecule
Emp. Form.:
C24H35F3O5
Mol. Mass.:
460.5269
SMILES:
O[C@H](CC[C@H]1[C@H](O)C[C@H](O)[C@@H]1CCCCCCC(O)=O)CCc1cccc(c1)C(F)(F)F
: