Target
Prostaglandin E2 receptor EP3 subtype
Ligand
BDBM50090136
Substrate
Meas. Tech.
ChEMBL_157810 (CHEMBL768758)
EC50
2000±n/a nM
Citation
 deLong, MAAmburgey, JTaylor, CWos, JASoper, DLWang, YHicks, R Synthesis and in vitro evaluation of human FP-receptor selective prostaglandin analogues. Bioorg Med Chem Lett 10:1519-22 (2000)  
Target
Name:
Prostaglandin E2 receptor EP3 subtype
Synonyms:
PE2R3_HUMAN PGE2-R Prostaglandin E2 receptor Prostaglandin E2 receptor EP3 subtype (EP3) Prostaglandin E2 receptor EP3D subtype (EP3D) | Prostanoid EP3 receptor
Type:
Enzyme
Mol. Mass.:
43335.03
Organism:
Homo sapiens (Human)
Description:
P43115
Residue:
390
  
Inhibitor
Name:
BDBM50090136
Synonyms:
(Z)-7-[(1R,2R,3R,5S)-3,5-Dihydroxy-2-((E)-(R)-3-hydroxy-4,4-dimethyl-oct-1-enyl)-cyclopentyl]-hept-5-enoic acid 7-[(1R,2R,4S,5R)-3,5-Dihydroxy-2-((E)-(R)-3-hydroxy-4,4-dimethyl-oct-1-enyl)-cyclopentyl]-hept-5-enoic acid | CHEMBL40183
Type:
Small organic molecule
Emp. Form.:
C22H38O5
Mol. Mass.:
382.5341
SMILES:
CCCCC(C)(C)[C@H](O)\C=C\[C@H]1[C@H](O)C[C@H](O)[C@@H]1C\C=C/CCCC(O)=O
: