Target
Thromboxane A2 receptor
Ligand
BDBM50085917
Substrate
Meas. Tech.
ChEBML_210261
IC50
>10000±n/a nM
Citation
 deLong, MAAmburgey, JTaylor, CWos, JASoper, DLWang, YHicks, R Synthesis and in vitro evaluation of human FP-receptor selective prostaglandin analogues. Bioorg Med Chem Lett 10:1519-22 (2000)  
Target
Name:
Thromboxane A2 receptor
Synonyms:
Prostanoid TP receptor TBXA2R Thromboxane Thromboxane Beta
Type:
Enyzme
Mol. Mass.:
37445.28
Organism:
Homo sapiens (Human)
Description:
P21731
Residue:
343
  
Inhibitor
Name:
BDBM50085917
Synonyms:
7-[(1R,2R,3R,5S)-3,5-Dihydroxy-2-((R)-3-hydroxy-5-phenyl-pentyl)-cyclopentyl]-heptanoic acid CHEMBL290969
Type:
Small organic molecule
Emp. Form.:
C23H36O5
Mol. Mass.:
392.5289
SMILES:
O[C@H](CC[C@H]1[C@H](O)C[C@H](O)[C@@H]1CCCCCCC(O)=O)CCc1ccccc1
: