Target
Prostaglandin F2-alpha receptor
Ligand
BDBM50090140
Substrate
Meas. Tech.
ChEMBL_157959 (CHEMBL766821)
IC50
8.6±n/a nM
Citation
 deLong, MAAmburgey, JTaylor, CWos, JASoper, DLWang, YHicks, R Synthesis and in vitro evaluation of human FP-receptor selective prostaglandin analogues. Bioorg Med Chem Lett 10:1519-22 (2000)  
Target
Name:
Prostaglandin F2-alpha receptor
Synonyms:
PF2R_HUMAN PGF2 alpha receptor PTGFR Prostanoid FP receptor
Type:
Enzyme
Mol. Mass.:
40072.29
Organism:
Homo sapiens (Human)
Description:
P43088
Residue:
359
  
Inhibitor
Name:
BDBM50090140
Synonyms:
7-{(1R,2R,3R,5S)-3,5-Dihydroxy-2-[(R)-3-hydroxy-5-(3-trifluoromethyl-phenyl)-pentyl]-cyclopentyl}-heptanoic acid | CHEMBL39784
Type:
Small organic molecule
Emp. Form.:
C24H35F3O5
Mol. Mass.:
460.5269
SMILES:
O[C@H](CC[C@H]1[C@H](O)C[C@H](O)[C@@H]1CCCCCCC(O)=O)CCc1cccc(c1)C(F)(F)F
: