Target
Prostaglandin E2 receptor EP3 subtype
Ligand
BDBM50090135
Substrate
Meas. Tech.
ChEBML_157808
IC50
>10000±n/a nM
Citation
 deLong, MAAmburgey, JTaylor, CWos, JASoper, DLWang, YHicks, R Synthesis and in vitro evaluation of human FP-receptor selective prostaglandin analogues. Bioorg Med Chem Lett 10:1519-22 (2000)  
Target
Name:
Prostaglandin E2 receptor EP3 subtype
Synonyms:
PE2R3_HUMAN PGE2-R Prostaglandin E2 receptor Prostaglandin E2 receptor EP3 subtype (EP3) Prostaglandin E2 receptor EP3D subtype (EP3D) | Prostanoid EP3 receptor
Type:
Enzyme
Mol. Mass.:
43335.03
Organism:
Homo sapiens (Human)
Description:
P43115
Residue:
390
  
Inhibitor
Name:
BDBM50090135
Synonyms:
7-{(1R,2R,3R,5S)-2-[(R)-5-(4-Fluoro-phenyl)-3-hydroxy-pentyl]-3,5-dihydroxy-cyclopentyl}-heptanoic acid | CHEMBL36911
Type:
Small organic molecule
Emp. Form.:
C23H35FO5
Mol. Mass.:
410.5194
SMILES:
O[C@H](CC[C@H]1[C@H](O)C[C@H](O)[C@@H]1CCCCCCC(O)=O)CCc1ccc(F)cc1
: