Target
Alpha-1A adrenergic receptor
Ligand
BDBM50090647
Substrate
Meas. Tech.
ChEMBL_32507 (CHEMBL640541)
Ki
0.170000±n/a nM
Citation
 Lagu, BTian, DJeon, YLi, CWetzel, JMNagarathnam, DShen, QForray, CChang, RSBroten, TPRansom, RWChan, TBO'Malley, SSSchorn, TWRodrigues, ADKassahun, KPettibone, DJFreidinger, ROGluchowski, C De novo design of a novel oxazolidinone analogue as a potent and selective alpha1A adrenergic receptor antagonist with high oral bioavailability. J Med Chem 43:2775-8 (2000)  
Target
Name:
Alpha-1A adrenergic receptor
Synonyms:
ADA1A_HUMAN ADRA1C Alpha 1A-adrenoceptor Alpha adrenergic receptor 1a Alpha-adrenergic receptor 1c adrenergic Alpha1 | adrenergic Alpha1C
Type:
Cell-surface receptors
Mol. Mass.:
51511.67
Organism:
Homo sapiens (Human)
Description:
P35348
Residue:
466
  
Inhibitor
Name:
BDBM50090647
Synonyms:
(4S,5S)-4-(3,4-Difluoro-phenyl)-5-methyl-2-oxo-oxazolidine-3-carboxylic acid {3-[4-(4-fluoro-phenyl)-piperidin-1-yl]-propyl}-amide 4-(3,4-Difluoro-phenyl)-5-methyl-2-oxo-oxazolidine-3-carboxylic acid {3-[4-(4-fluoro-phenyl)-piperidin-1-yl]-propyl}-amide SNAP-7915
Type:
Small organic molecule
Emp. Form.:
C25H28F3N3O3
Mol. Mass.:
475.5033
SMILES:
C[C@@H]1OC(=O)N([C@H]1c1ccc(F)c(F)c1)C(=O)NCCCN1CCC(CC1)c1ccc(F)cc1
: