Target
Adenosine kinase
Ligand
BDBM50090876
Substrate
Meas. Tech.
ChEMBL_31116 (CHEMBL643544)
IC50
1200±n/a nM
Citation
 Ugarkar, BGCastellino, AJDaRe, JMKopcho, JJWiesner, JBSchanzer, JMErion, MD Adenosine kinase inhibitors. 2. Synthesis, enzyme inhibition, and antiseizure activity of diaryltubercidin analogues. J Med Chem 43:2894-905 (2000)  
Target
Name:
Adenosine kinase
Synonyms:
ADK | ADK_HUMAN
Type:
PROTEIN
Mol. Mass.:
40545.97
Organism:
Homo sapiens (Human)
Description:
ChEMBL_1467841
Residue:
362
  
Inhibitor
Name:
BDBM50090876
Synonyms:
4-[7-(3,4-Dihydroxy-5-methyl-tetrahydro-furan-2-yl)-5-iodo-7H-pyrrolo[2,3-d]pyrimidin-4-ylamino]-benzonitrile | CHEMBL99923
Type:
Small organic molecule
Emp. Form.:
C18H16IN5O3
Mol. Mass.:
477.2558
SMILES:
C[C@H]1O[C@H]([C@H](O)[C@@H]1O)n1cc(I)c2c(Nc3ccc(cc3)C#N)ncnc12
: