Target
Protein kinase C alpha type
Ligand
BDBM50085889
Substrate
Meas. Tech.
ChEMBL_160292 (CHEMBL769620)
Ki
2.3±n/a nM
Citation
 Tamamura, HBienfait, BNacro, KLewin, NEBlumberg, PMMarquez, VE Conformationally constrained analogues of diacylglycerol (DAG). 17. Contrast between sn-1 and sn-2 DAG lactones in binding to protein kinase C. J Med Chem 43:3209-17 (2000)  
Target
Name:
Protein kinase C alpha type
Synonyms:
KPCA_HUMAN PKC alpha and beta-2 PKC-alpha PRKACA Protein Kinase C- alpha Protein kinase C alpha (PKCa) Protein kinase C alpha type (PRKCA) RAF proto-oncogene serine/threonine-protein kinase
Type:
Enzyme
Mol. Mass.:
76755.65
Organism:
Homo sapiens (Human)
Description:
The recombinant human PKC enzymes were produced using a baculovirus expression system in SF9 cells
Residue:
672
  
Inhibitor
Name:
BDBM50085889
Synonyms:
CHEMBL111625 Decanoic acid 2-hydroxymethyl-4-[3-isopropyl-4-methyl-pent-(Z)-ylidene]-5-oxo-tetrahydro-furan-2-ylmethyl ester
Type:
Small organic molecule
Emp. Form.:
C25H44O5
Mol. Mass.:
424.6139
SMILES:
CCCCCCCCCC(=O)OCC1(CO)C\C(=C\CC(C(C)C)C(C)C)C(=O)O1
: