Target
Protein kinase C alpha type
Ligand
BDBM50091245
Substrate
Meas. Tech.
ChEMBL_160434 (CHEMBL762305)
Ki
2.9±n/a nM
Citation
 Tamamura, HBienfait, BNacro, KLewin, NEBlumberg, PMMarquez, VE Conformationally constrained analogues of diacylglycerol (DAG). 17. Contrast between sn-1 and sn-2 DAG lactones in binding to protein kinase C. J Med Chem 43:3209-17 (2000)  
Target
Name:
Protein kinase C alpha type
Synonyms:
KPCA_HUMAN PKC alpha and beta-2 PKC-alpha PRKACA Protein Kinase C- alpha Protein kinase C alpha (PKCa) Protein kinase C alpha type (PRKCA) RAF proto-oncogene serine/threonine-protein kinase
Type:
Enzyme
Mol. Mass.:
76755.65
Organism:
Homo sapiens (Human)
Description:
The recombinant human PKC enzymes were produced using a baculovirus expression system in SF9 cells
Residue:
672
  
Inhibitor
Name:
BDBM50091245
Synonyms:
3-Methyl-butyric acid 2-hydroxymethyl-4-(3-methyl-butylidene)-5-oxo-tetrahydro-furan-2-ylmethyl ester | CHEMBL108145
Type:
Small organic molecule
Emp. Form.:
C16H26O5
Mol. Mass.:
298.3746
SMILES:
CC(C)C\C=C1\CC(CO)(COC(=O)CC(C)C)OC1=O
: