Target
Neuropeptide Y receptor type 2
Ligand
BDBM50091668
Substrate
Meas. Tech.
ChEMBL_143675 (CHEMBL755164)
IC50
1.3±n/a nM
Citation
 Balasubramaniam, ATao, ZZhai, WStein, MSheriff, SChance, WTFischer, JEEden, PETaylor, JELiu, CDMcFadden, DWVoisin, TRoze, CLaburthe, M Structure-activity studies including a Psi(CH(2)-NH) scan of peptide YY (PYY) active site, PYY(22-36), for interaction with rat intestinal PYY receptors: development of analogues with potent in vivo activity in the intestine. J Med Chem 43:3420-7 (2000)  
Target
Name:
Neuropeptide Y receptor type 2
Synonyms:
NPY-Y2 NPY2-R NPY2R_HUMAN Y2 receptor | neuropeptide Y receptor Y2
Type:
Enzyme Catalytic Domain
Mol. Mass.:
42734.65
Organism:
Homo sapiens (Human)
Description:
NPY-Y2 NPY2R HUMAN::P49146
Residue:
381
  
Inhibitor
Name:
BDBM50091668
Synonyms:
AcPYY(22-36) N-alpha-Ac-PYY(22-36)-NH2(N-alpha-Ac-ASLAHYLNLVTRQRY-NH2)
Type:
Small organic molecule
Emp. Form.:
C86H139N29O22
Mol. Mass.:
1931.205
SMILES:
CC(C)C[C@H](NC(=O)[C@H](CO)NC(=O)[C@H](C)NC(C)=O)C(=O)N[C@@H](CCCNC(N)=N)C(=O)N[C@@H](Cc1cnc[nH]1)C(=O)N[C@@H](Cc1ccc(O)cc1)C(=O)N[C@@H](CC(C)C)C(=O)N[C@@H](CC(N)=O)C(=O)N[C@@H](CC(C)C)C(=O)N[C@@H](C(C)C)C(=O)N[C@@H]([C@@H](C)O)C(=O)N[C@@H](CCCNC(N)=N)C(=O)N[C@@H](CCC(N)=O)C(=O)N[C@@H](CCCNC(N)=N)C(=O)N[C@@H](Cc1ccc(O)cc1)C(N)=O
: