Target
Muscarinic acetylcholine receptor M4
Ligand
BDBM50451114
Substrate
Meas. Tech.
ChEBML_139127
Ki
0.320000±n/a nM
Citation
 Billard, WBinch, HBratzler, KChen, LYCrosby, GDuffy, RADugar, SLachowicz, JMcQuade, RPushpavanam, PRuperto, VBTaylor, LAClader, JW Diphenylsulfone muscarinic antagonists: piperidine derivatives with high M2 selectivity and improved potency. Bioorg Med Chem Lett 10:2209-12 (2001)  
Target
Name:
Muscarinic acetylcholine receptor M4
Synonyms:
ACM4_HUMAN Cholinergic, muscarinic M4 Muscarinic acetylcholine receptor M2 and M4
Type:
Enzyme Catalytic Domain
Mol. Mass.:
53079.31
Organism:
Homo sapiens (Human)
Description:
Cholinergic, muscarinic M4 CHRM4 HUMAN M3::P08173
Residue:
479
  
Inhibitor
Name:
BDBM50451114
Synonyms:
CHEMBL2115128
Type:
Small organic molecule
Emp. Form.:
C26H33NO2S
Mol. Mass.:
423.611
SMILES:
COc1ccc(cc1)[S@@+]([O-])c1ccc(cc1)C(=C)C1CCN(CC1)C1CCCCC1
: