Target
Muscarinic acetylcholine receptor M2
Ligand
BDBM50092322
Substrate
Meas. Tech.
ChEBML_139773
Ki
0.370000±n/a nM
Citation
 Billard, WBinch, HBratzler, KChen, LYCrosby, GDuffy, RADugar, SLachowicz, JMcQuade, RPushpavanam, PRuperto, VBTaylor, LAClader, JW Diphenylsulfone muscarinic antagonists: piperidine derivatives with high M2 selectivity and improved potency. Bioorg Med Chem Lett 10:2209-12 (2001)  
Target
Name:
Muscarinic acetylcholine receptor M2
Synonyms:
ACM2_HUMAN Cholinergic, muscarinic M2 Muscarinic acetylcholine receptor M2 and M5 | RecName: Full=Muscarinic acetylcholine receptor M2
Type:
GPCR
Mol. Mass.:
51730.61
Organism:
Homo sapiens (Human)
Description:
P08172
Residue:
466
  
Inhibitor
Name:
BDBM50092322
Synonyms:
1-Cyclohexyl-4-{1-[4-(4-methoxy-phenylsulfanyl)-phenyl]-vinyl}-piperidine | CHEMBL70828
Type:
Small organic molecule
Emp. Form.:
C26H33NOS
Mol. Mass.:
407.611
SMILES:
COc1ccc(Sc2ccc(cc2)C(=C)C2CCN(CC2)C2CCCCC2)cc1
: