Target
5-hydroxytryptamine receptor 4
Ligand
BDBM50056393
Substrate
Meas. Tech.
ChEMBL_3569 (CHEMBL620702)
Ki
12.5±n/a nM
Citation
 Curtet, SSoulier, JLZahradnik, IGiner, MBerque-Bestel, IMialet, JLezoualc'h, FDonzeau-Gouge, PSicsic, SFischmeister, RLanglois, M New arylpiperazine derivatives as antagonists of the human cloned 5-HT(4) receptor isoforms. J Med Chem 43:3761-9 (2000)  
Target
Name:
5-hydroxytryptamine receptor 4
Synonyms:
5-HT-4 5-HT4S 5-HT4b 5-HT4d 5-hydroxytryptamine receptor 4 5HT4R_HUMAN Serotonin (5-HT) receptor Serotonin 4 (5-HT4) receptor | Serotonin Receptor 4
Type:
Enzyme
Mol. Mass.:
43767.54
Organism:
Homo sapiens (Human)
Description:
Q13639
Residue:
388
  
Inhibitor
Name:
BDBM50056393
Synonyms:
4-Amino-5-chloro-2-methoxy-benzoic acid 2-(4-phenyl-piperazin-1-yl)-ethyl ester | CHEMBL123377
Type:
Small organic molecule
Emp. Form.:
C20H24ClN3O3
Mol. Mass.:
389.876
SMILES:
COc1cc(N)c(Cl)cc1C(=O)OCCN1CCN(CC1)c1ccccc1
: