Target
Poly [ADP-ribose] polymerase 2
Ligand
BDBM50316226
Substrate
Meas. Tech.
ChEMBL_1935272 (CHEMBL4481031)
Ki
4.0±n/a nM
Citation
 Jain, PGPatel, BD Medicinal chemistry approaches of poly ADP-Ribose polymerase 1 (PARP1) inhibitors as anticancer agents - A recent update. Eur J Med Chem 165:198-215 (2019)  
Target
Name:
Poly [ADP-ribose] polymerase 2
Synonyms:
(ARTD2 or PARP2) ADPRTL2 PARP2_HUMAN Poly [ADP-ribose] polymerase 2 (PARP2)
Type:
Enzyme
Mol. Mass.:
66225.70
Organism:
Homo sapiens (Human)
Description:
Q9UGN5
Residue:
583
  
Inhibitor
Name:
BDBM50316226
Synonyms:
(S)-2-(4-(piperidin-3-yl)phenyl)-2H-indazole-7-carboxamide MK-4827 | Niraparib
Type:
Small organic molecule
Emp. Form.:
C19H20N4O
Mol. Mass.:
320.3883
SMILES:
NC(=O)c1cccc2cn(nc12)-c1ccc(cc1)[C@@H]1CCCNC1
: