Target
Sigma intracellular receptor 2
Ligand
BDBM50536985
Substrate
Meas. Tech.
ChEMBL_1935276 (CHEMBL4481035)
Ki
0.660000±n/a nM
Citation
 Intagliata, SAlsharif, WFMesangeau, CFazio, NSeminerio, MXu, YTMatsumoto, RRMcCurdy, CR Benzimidazolone-based selective ? Eur J Med Chem 165:250-257 (2019)  
Target
Name:
Sigma intracellular receptor 2
Synonyms:
S2r Sigma intracellular receptor 2 Sigma2 receptor Transmembrane protein 97
Type:
Protein
Mol. Mass.:
20953.88
Organism:
Rattus norvegicus (Rat)
Description:
Q5U3Y7
Residue:
176
  
Inhibitor
Name:
BDBM50536985
Synonyms:
CHEMBL4531345
Type:
Small organic molecule
Emp. Form.:
C24H31FN4O
Mol. Mass.:
410.5275
SMILES:
CCCn1c2ccccc2n(CCCCN2CCN(CC2)c2ccc(F)cc2)c1=O
: