Target
Plasminogen
Ligand
BDBM50093059
Substrate
Meas. Tech.
ChEBML_155406
IC50
>2500±n/a nM
Citation
 Semple, JELevy, OEMinami, NKOwens, TDSiev, DV Novel, potent and selective chimeric FXa inhibitors featuring hydrophobic P1-ketoamide moieties. Bioorg Med Chem Lett 10:2305-9 (2001)  
Target
Name:
Plasminogen
Synonyms:
Activation peptide PLG Plasmin Plasmin heavy chain A, short form | Plasmin light chain B
Type:
Enzyme
Mol. Mass.:
90579.18
Organism:
Homo sapiens (Human)
Description:
Residue:
810
  
Inhibitor
Name:
BDBM50093059
Synonyms:
((S)-4-(4-tert-Butoxy-phenyl)-3-{2-[((R)-5-guanidino-2-phenylmethanesulfonylamino-pentanoyl)-methyl-amino]-acetylamino}-2-oxo-butyrylamino)-acetic acid ethyl ester; TFA | CHEMBL311152
Type:
Small organic molecule
Emp. Form.:
C34H49N7O9S
Mol. Mass.:
731.859
SMILES:
CCOC(=O)CNC(=O)C(=O)[C@H](Cc1ccc(OC(C)(C)C)cc1)NC(=O)CN(C)C(=O)[C@@H](CCCNC(N)=N)NS(=O)(=O)Cc1ccccc1
: