Target
Prothrombin
Ligand
BDBM50093062
Substrate
Meas. Tech.
ChEBML_209068
IC50
3830±n/a nM
Citation
 Semple, JELevy, OEMinami, NKOwens, TDSiev, DV Novel, potent and selective chimeric FXa inhibitors featuring hydrophobic P1-ketoamide moieties. Bioorg Med Chem Lett 10:2305-9 (2001)  
Target
Name:
Prothrombin
Synonyms:
Activation peptide fragment 1 Coagulation factor II Prothrombin precursor Thrombin heavy chain | Thrombin light chain
Type:
Protein
Mol. Mass.:
70029.57
Organism:
Homo sapiens (Human)
Description:
P00734
Residue:
622
  
Inhibitor
Name:
BDBM50093062
Synonyms:
(R)-5-Guanidino-2-phenylmethanesulfonylamino-pentanoic acid [((S)-1-cyclohexylmethyl-2-oxo-2-pentylcarbamoyl-ethylcarbamoyl)-methyl]-methyl-amide | CHEMBL305646
Type:
Small organic molecule
Emp. Form.:
C31H51N7O6S
Mol. Mass.:
649.845
SMILES:
CCCCCNC(=O)C(=O)[C@H](CC1CCCCC1)NC(=O)CN(C)C(=O)[C@@H](CCCNC(N)=N)NS(=O)(=O)Cc1ccccc1
: