Target
Coagulation factor X
Ligand
BDBM50093064
Substrate
Meas. Tech.
ChEBML_160982
IC50
46±n/a nM
Citation
 Semple, JELevy, OEMinami, NKOwens, TDSiev, DV Novel, potent and selective chimeric FXa inhibitors featuring hydrophobic P1-ketoamide moieties. Bioorg Med Chem Lett 10:2305-9 (2001)  
Target
Name:
Coagulation factor X
Synonyms:
Activated coagulation factor X (FXa) Coagulation factor X precursor F10 Factor X heavy chain Factor Xa Stuart-Prower factor
Type:
Enzyme
Mol. Mass.:
54726.60
Organism:
Homo sapiens (Human)
Description:
Residue:
488
  
Inhibitor
Name:
BDBM50093064
Synonyms:
(R)-5-Nitro-Guanidino-2-phenylmethanesulfonylamino-pentanoic acid ({(S)-2-[(benzo[1,3]dioxol-5-ylmethyl)-carbamoyl]-1-cyclohexylmethyl-2-oxo-ethylcarbamoyl}-methyl)-methyl-amide | CHEMBL75006
Type:
Small organic molecule
Emp. Form.:
C33H44N8O10S
Mol. Mass.:
744.815
SMILES:
CN(CC(=O)N[C@@H](CC1CCCCC1)C(=O)C(=O)NCc1ccc2OCOc2c1)C(=O)[C@@H](CCN=C(N)N[N+]([O-])=O)NS(=O)(=O)Cc1ccccc1
: