Target
Enoyl-[acyl-carrier-protein] reductase [NADH]
Ligand
BDBM50336507
Substrate
Meas. Tech.
ChEMBL_1936197 (CHEMBL4481956)
IC50
8290±n/a nM
Citation
 Xu, JFWang, TTYuan, QDuan, YTXu, YJLv, PCWang, XMYang, YSZhu, HL Discovery and development of novel rhodanine derivatives targeting enoyl-acyl carrier protein reductase. Bioorg Med Chem 27:1509-1516 (2019)  
Target
Name:
Enoyl-[acyl-carrier-protein] reductase [NADH]
Synonyms:
Enoyl-ACP Reductase (InhA) Enoyl-[acyl-carrier-protein] reductase [NADH] NADH-dependent enoyl-ACP reductase | inhA
Type:
Enzyme
Mol. Mass.:
28526.00
Organism:
Mycobacterium tuberculosis (strain ATCC 25618 / H37Rv)
Description:
P9WGR1
Residue:
269
  
Inhibitor
Name:
BDBM50336507
Synonyms:
4-pyridinecarbohydrazide(Isoniazid) Dow-isoniazid INH Isoniazid (INH) Isonicotinic acid hydrazide(Isoniazid) Laniazid Rimifon isoniazid isonicotinhydrazide isonicotinyl hydrazide | pyridine-4-carbohydrazide
Type:
Small organic molecule
Emp. Form.:
C6H7N3O
Mol. Mass.:
137.1393
SMILES:
NNC(=O)c1ccncc1
: