Target
Melatonin receptor type 1A
Ligand
BDBM50093288
Substrate
Meas. Tech.
ChEMBL_104944 (CHEMBL713111)
Ki
0.19±n/a nM
Citation
 Jellimann, CMathé-Allainmat, MAndrieux, JKloubert, SBoutin, JANicolas, JPBennejean, CDelagrange, PLanglois, M Synthesis of phenalene and acenaphthene derivatives as new conformationally restricted ligands for melatonin receptors. J Med Chem 43:4051-62 (2000)  
Target
Name:
Melatonin receptor type 1A
Synonyms:
MTNR1A MTR1A_HUMAN Mel1a melatonin receptor Melatonin receptor Melatonin receptor type 1 (MT1) | Melatonin receptor type 1A
Type:
Enzyme
Mol. Mass.:
39392.94
Organism:
Homo sapiens (Human)
Description:
P48039
Residue:
350
  
Inhibitor
Name:
BDBM50093288
Synonyms:
CHEMBL129889 | N-(4-Methoxy-2,3-dihydro-1H-phenalen-1-ylmethyl)-propionamide
Type:
Small organic molecule
Emp. Form.:
C18H21NO2
Mol. Mass.:
283.3648
SMILES:
CCC(=O)NCC1CCc2c(OC)ccc3cccc1c23
: