Target
Cathepsin B
Ligand
BDBM50093803
Substrate
Meas. Tech.
ChEBML_47584
Ki
6780±n/a nM
Citation
 Donkor, IOZheng, XMiller, DD Synthesis and calpain inhibitory activity of alpha-ketoamides with 2,3-methanoleucine stereoisomers at the P2 position. Bioorg Med Chem Lett 10:2497-500 (2001)  
Target
Name:
Cathepsin B
Synonyms:
APP secretase CATB_HUMAN CTSB Cathepsin B light chain | Cathepsin B1
Type:
Enzyme
Mol. Mass.:
37819.69
Organism:
Homo sapiens (Human)
Description:
gi_63102437
Residue:
339
  
Inhibitor
Name:
BDBM50093803
Synonyms:
CHEMBL316201 | [(1S,2S)-1-((S)-1-Benzyl-2-oxo-2-phenethylcarbamoyl-ethylcarbamoyl)-2-isopropyl-cyclopropyl]-carbamic acid benzyl ester
Type:
Small organic molecule
Emp. Form.:
C33H37N3O5
Mol. Mass.:
555.664
SMILES:
CC(C)[C@@H]1C[C@@]1(NC(=O)OCc1ccccc1)C(=O)N[C@@H](Cc1ccccc1)C(=O)C(=O)NCCc1ccccc1
: