Target
Vasopressin V2 receptor
Ligand
BDBM35714
Substrate
Meas. Tech.
ChEMBL_214848 (CHEMBL824690)
Ki
9.42±n/a nM
Citation
 Kondo, KOgawa, HShinohara, TKurimura, MTanada, YKan, KYamashita, HNakamura, SHirano, TYamamura, YMori, TTominaga, MItai, A Novel design of nonpeptide AVP V(2) receptor agonists: structural requirements for an agonist having 1-(4-aminobenzoyl)-2,3,4, 5-tetrahydro-1H-1-benzazepine as a template. J Med Chem 43:4388-97 (2000)  
Target
Name:
Vasopressin V2 receptor
Synonyms:
ADHR AVPR2 DIR Renal-type arginine vasopressin receptor V2R_HUMAN Vasopressin V2 receptor | Vasopressin receptor
Type:
Receptor
Mol. Mass.:
40295.28
Organism:
Homo sapiens (Human)
Description:
P30518
Residue:
371
  
Inhibitor
Name:
BDBM35714
Synonyms:
CHEMBL420762 N-[4-(5-Dimethylamino-2,3,4,5-tetrahydro-benzo[b]azepine-1-carbonyl)-phenyl]-2-methyl-benzamide | OPC-31260
Type:
Small organic molecule
Emp. Form.:
C27H29N3O2
Mol. Mass.:
427.5381
SMILES:
CN(C)C1CCCN(C(=O)c2ccc(NC(=O)c3ccccc3C)cc2)c2ccccc12
: