Target
Vasopressin V1a receptor
Ligand
BDBM50094076
Substrate
Meas. Tech.
ChEMBL_214550 (CHEMBL820019)
IC50
5100±n/a nM
Citation
 Kondo, KOgawa, HShinohara, TKurimura, MTanada, YKan, KYamashita, HNakamura, SHirano, TYamamura, YMori, TTominaga, MItai, A Novel design of nonpeptide AVP V(2) receptor agonists: structural requirements for an agonist having 1-(4-aminobenzoyl)-2,3,4, 5-tetrahydro-1H-1-benzazepine as a template. J Med Chem 43:4388-97 (2000)  
Target
Name:
Vasopressin V1a receptor
Synonyms:
Avpr1a VASOPRESSIN V1A Vasopressin V1a receptor | Vasopressin receptor
Type:
Enzyme Catalytic Domain
Mol. Mass.:
47674.81
Organism:
RAT
Description:
VASOPRESSIN V1A AVPR1A RAT::P30560
Residue:
424
  
Inhibitor
Name:
BDBM50094076
Synonyms:
CHEMBL434654 | N-[4-(7-Chloro-2,3,4,5-tetrahydro-benzo[b]azepine-1-carbonyl)-3-methyl-phenyl]-2-o-tolyloxy-acetamide
Type:
Small organic molecule
Emp. Form.:
C27H27ClN2O3
Mol. Mass.:
462.968
SMILES:
Cc1ccccc1OCC(=O)Nc1ccc(C(=O)N2CCCCc3cc(Cl)ccc23)c(C)c1
: