Target
Steroid 17-alpha-hydroxylase/17,20 lyase
Ligand
BDBM50094193
Substrate
Meas. Tech.
ChEMBL_50360 (CHEMBL662520)
IC50
1800±n/a nM
Citation
 Hartmann, RWHector, MWachall, BGPalusczak, APalzer, MHuch, VVeith, M Synthesis and evaluation of 17-aliphatic heterocycle-substituted steroidal inhibitors of 17alpha-hydroxylase/C17-20-lyase (P450 17). J Med Chem 43:4437-45 (2000)  
Target
Name:
Steroid 17-alpha-hydroxylase/17,20 lyase
Synonyms:
CP17A_HUMAN CYP17A1 Cytochrome P450 17A1 Cytochrome P450 C17 (CYP17) Cytochrome P450-C17 P450-C17 Steroid 17-alpha-Monooxygenase (CYP17) Steroid 17-alpha-monooxygenase | cytochrome P450 monooxygenase 17 alpha hydroxylase/17,20-lyase (CYP17)
Type:
Enzyme
Mol. Mass.:
57382.42
Organism:
Homo sapiens (Human)
Description:
E.coli expressing human CYP17
Residue:
508
  
Inhibitor
Name:
BDBM50094193
Synonyms:
(R)-10,13-Dimethyl-17-thiiranyl-2,3,4,7,8,9,10,11,12,13,14,15,16,17-tetradecahydro-1H-cyclopenta[a]phenanthren-3-ol CHEMBL136350
Type:
Small organic molecule
Emp. Form.:
C21H32OS
Mol. Mass.:
332.543
SMILES:
CC12CCC3C(CC=C4CC(O)CCC34C)C1CCC2C1CS1
: