Target
Aromatase
Ligand
BDBM50409041
Substrate
Meas. Tech.
ChEMBL_50715 (CHEMBL666794)
IC50
>50000±n/a nM
Citation
 Hartmann, RWHector, MWachall, BGPalusczak, APalzer, MHuch, VVeith, M Synthesis and evaluation of 17-aliphatic heterocycle-substituted steroidal inhibitors of 17alpha-hydroxylase/C17-20-lyase (P450 17). J Med Chem 43:4437-45 (2000)  
Target
Name:
Aromatase
Synonyms:
ARO1 CP19A_HUMAN CYP19 CYPXIX Cytochrome P450 19A1 Cytochrome P450-C19 (CYP19) FL cytokine receptor precursor | P-450AROM
Type:
Enzyme
Mol. Mass.:
57888.92
Organism:
Homo sapiens (Human)
Description:
P11511
Residue:
503
  
Inhibitor
Name:
BDBM50409041
Synonyms:
CHEMBL2111947
Type:
Small organic molecule
Emp. Form.:
C21H33NO
Mol. Mass.:
315.4928
SMILES:
C[C@]12CC[C@H]3[C@@H](CC=C4C[C@@H](O)CC[C@]34C)[C@@H]1CC[C@@H]2[C@H]1CN1
: