Target
Muscarinic acetylcholine receptor M4
Ligand
BDBM50538317
Substrate
Meas. Tech.
ChEMBL_1972536 (CHEMBL4605354)
Ki
0.446684±n/a nM
Citation
 She, XPegoli, AGruber, CGWifling, DCarpenter, JHübner, HChen, MWan, JBernhardt, GGmeiner, PHolliday, NDKeller, M Red-Emitting Dibenzodiazepinone Derivatives as Fluorescent Dualsteric Probes for the Muscarinic Acetylcholine M J Med Chem 63:4133-4154 (2020)  
Target
Name:
Muscarinic acetylcholine receptor M4
Synonyms:
ACM4_HUMAN Cholinergic, muscarinic M4 Muscarinic acetylcholine receptor M2 and M4
Type:
Enzyme Catalytic Domain
Mol. Mass.:
53079.31
Organism:
Homo sapiens (Human)
Description:
Cholinergic, muscarinic M4 CHRM4 HUMAN M3::P08173
Residue:
479
  
Inhibitor
Name:
BDBM50538317
Synonyms:
CHEMBL4636083
Type:
Small organic molecule
Emp. Form.:
C38H46F12N6O10
Mol. Mass.:
974.7869
SMILES:
OC(=O)C(F)(F)F.OC(=O)C(F)(F)F.OC(=O)C(F)(F)F.OC(=O)C(F)(F)F.NCCN1CCN(CCCCC2CCN(CC(=O)N3c4ccccc4NC(=O)c4ccccc34)CC2)CC1
: