Target
Dihydroorotate dehydrogenase (quinone), mitochondrial
Ligand
BDBM50018011
Substrate
Meas. Tech.
ChEMBL_1972579 (CHEMBL4605397)
IC50
17±n/a nM
Citation
 Kokkonda, SDeng, XWhite, KLEl Mazouni, FWhite, JShackleford, DMKatneni, KChiu, FCKBarker, HMcLaren, JCrighton, EChen, GAngulo-Barturen, IJimenez-Diaz, MBFerrer, SHuertas-Valentin, LMartinez-Martinez, MSLafuente-Monasterio, MJChittimalla, RShahi, SPWittlin, SWaterson, DBurrows, JNMatthews, DTomchick, DRathod, PKPalmer, MJCharman, SAPhillips, MA Lead Optimization of a Pyrrole-Based Dihydroorotate Dehydrogenase Inhibitor Series for the Treatment of Malaria. J Med Chem 63:4929-4956 (2020)  
Target
Name:
Dihydroorotate dehydrogenase (quinone), mitochondrial
Synonyms:
DHOdehase Dihydroorotate Dehydrogenase (DHODH) Dihydroorotate oxidase | PYRD_RAT
Type:
Enzyme
Mol. Mass.:
42672.97
Organism:
Rattus norvegicus (rat)
Description:
The enzyme assay was performed with the histidine-tagged enzyme without cleavage of the tag.
Residue:
395
  
Inhibitor
Name:
BDBM50018011
Synonyms:
Aubagio HMR-1726 | TERIFLUNOMIDE
Type:
Small organic molecule
Emp. Form.:
C12H9F3N2O2
Mol. Mass.:
270.2073
SMILES:
C\C(O)=C(/C#N)C(=O)Nc1ccc(cc1)C(F)(F)F
: