Target
5-hydroxytryptamine receptor 1A
Ligand
BDBM50094670
Substrate
Meas. Tech.
ChEMBL_609 (CHEMBL615478)
EC50
0.13±n/a nM
Citation
 Blair, JBKurrasch-Orbaugh, DMarona-Lewicka, DCumbay, MGWatts, VJBarker, ELNichols, DE Effect of ring fluorination on the pharmacology of hallucinogenic tryptamines. J Med Chem 43:4701-10 (2001)  
Target
Name:
5-hydroxytryptamine receptor 1A
Synonyms:
5-HT-1A 5-hydroxytryptamine receptor 1A (5-HT-1A) ADRB2RL1 Dopamine D2 receptor and serotonin 1a receptor HTR1A | Serotonin receptor 1A
Type:
Mol. Mass.:
46122.49
Organism:
Homo sapiens (Human)
Description:
Residue:
422
  
Inhibitor
Name:
BDBM50094670
Synonyms:
1-(4-Dipropylamino-1,3,4,5-tetrahydro-benzo[cd]indol-6-yl)-ethanone LY 293284 LY-293384
Type:
Small organic molecule
Emp. Form.:
C19H26N2O
Mol. Mass.:
298.4225
SMILES:
CCCN(CCC)C1Cc2c[nH]c3ccc(C(C)=O)c(C1)c23
: