Target
5-hydroxytryptamine receptor 1A
Ligand
BDBM50094676
Substrate
Meas. Tech.
ChEMBL_609 (CHEMBL615478)
EC50
680±n/a nM
Citation
 Blair, JBKurrasch-Orbaugh, DMarona-Lewicka, DCumbay, MGWatts, VJBarker, ELNichols, DE Effect of ring fluorination on the pharmacology of hallucinogenic tryptamines. J Med Chem 43:4701-10 (2001)  
Target
Name:
5-hydroxytryptamine receptor 1A
Synonyms:
5-HT-1A 5-hydroxytryptamine receptor 1A (5-HT-1A) ADRB2RL1 Dopamine D2 receptor and serotonin 1a receptor HTR1A | Serotonin receptor 1A
Type:
Mol. Mass.:
46122.49
Organism:
Homo sapiens (Human)
Description:
Residue:
422
  
Inhibitor
Name:
BDBM50094676
Synonyms:
CHEMBL142936 N,N-diethyl-2-(1H-indol-3-yl)ethanamine
Type:
Small organic molecule
Emp. Form.:
C14H20N2
Mol. Mass.:
216.322
SMILES:
CCN(CC)CCc1c[nH]c2ccccc12
: