Target
5-hydroxytryptamine receptor 2C
Ligand
BDBM50094673
Substrate
Meas. Tech.
ChEMBL_2838 (CHEMBL621524)
Ki
16±n/a nM
Citation
 Blair, JBKurrasch-Orbaugh, DMarona-Lewicka, DCumbay, MGWatts, VJBarker, ELNichols, DE Effect of ring fluorination on the pharmacology of hallucinogenic tryptamines. J Med Chem 43:4701-10 (2001)  
Target
Name:
5-hydroxytryptamine receptor 2C
Synonyms:
5-HT2C 5-hydroxytryptamine receptor 2C (5HT2c) 5ht1c Htr2c Serotonin receptor 2a and 2c (5HT2A and 5HT2C)
Type:
Enzyme
Mol. Mass.:
51935.10
Organism:
Rattus norvegicus (Rat)
Description:
P08909
Residue:
460
  
Inhibitor
Name:
BDBM50094673
Synonyms:
CHEMBL342986 | Diethyl-[2-(5-methoxy-1H-indol-3-yl)-ethyl]-amine
Type:
Small organic molecule
Emp. Form.:
C15H22N2O
Mol. Mass.:
246.348
SMILES:
CCN(CC)CCc1c[nH]c2ccc(OC)cc12
: