Target
Adenosine receptor A1
Ligand
BDBM50094683
Substrate
Meas. Tech.
ChEMBL_28044 (CHEMBL643201)
Ki
238±n/a nM
Citation
 Baraldi, PGCacciari, BRomagnoli, RSpalluto, GMoro, SKlotz, KNLeung, EVarani, KGessi, SMerighi, SBorea, PA Pyrazolo[4,3-e]1,2,4-triazolo[1,5-c]pyrimidine derivatives as highly potent and selective human A(3) adenosine receptor antagonists: influence of the chain at the N(8) pyrazole nitrogen. J Med Chem 43:4768-80 (2000)  
Target
Name:
Adenosine receptor A1
Synonyms:
A1 adenosine receptor (hA1) AA1R_HUMAN ADORA1 Adenosine A1-receptor Adenosine receptor A1 (hA1) | Adenosine transporter (AdT)
Type:
G Protein-Coupled Receptor (GPCR)
Mol. Mass.:
36520.92
Organism:
Homo sapiens (Human)
Description:
P30542
Residue:
326
  
Inhibitor
Name:
BDBM50094683
Synonyms:
1-(3-Chloro-phenyl)-3-(2-furan-2-yl-8H-pyrazolo[4,3-e][1,2,4]triazolo[1,5-c]pyrimidin-5-yl)-urea CHEMBL142562
Type:
Small organic molecule
Emp. Form.:
C17H11ClN8O2
Mol. Mass.:
394.775
SMILES:
Clc1cccc(NC(=O)Nc2nc3n[nH]cc3c3nc(nn23)-c2ccco2)c1
: