Target
Adenosine receptor A3
Ligand
BDBM50082421
Substrate
Meas. Tech.
ChEMBL_30036 (CHEMBL640379)
Ki
0.98±n/a nM
Citation
 Baraldi, PGCacciari, BRomagnoli, RSpalluto, GMoro, SKlotz, KNLeung, EVarani, KGessi, SMerighi, SBorea, PA Pyrazolo[4,3-e]1,2,4-triazolo[1,5-c]pyrimidine derivatives as highly potent and selective human A(3) adenosine receptor antagonists: influence of the chain at the N(8) pyrazole nitrogen. J Med Chem 43:4768-80 (2000)  
Target
Name:
Adenosine receptor A3
Synonyms:
A3 adenosine receptor (hA3) ADORA3 | Adenosine A3 receptor (A3AR)
Type:
G Protein-Coupled Receptor (GPCR)
Mol. Mass.:
36197.32
Organism:
Homo sapiens (Human)
Description:
P0DMS8
Residue:
318
  
Inhibitor
Name:
BDBM50082421
Synonyms:
1-(2-(furan-2-yl)-8-phenethyl-8H-pyrazolo[4,3-e][1,2,4]triazolo[1,5-c]pyrimidin-5-yl)-3-(4-methoxyphenyl)urea CHEMBL422820
Type:
Small organic molecule
Emp. Form.:
C26H22N8O3
Mol. Mass.:
494.5047
SMILES:
COc1ccc(NC(=O)Nc2nc3nn(CCc4ccccc4)cc3c3nc(nn23)-c2ccco2)cc1
: