Target
Sodium-dependent serotonin transporter
Ligand
BDBM50063266
Substrate
Meas. Tech.
ChEMBL_202000 (CHEMBL809445)
Ki
0.163000±n/a nM
Citation
 Gerdes, JMDeFina, SCWilson, PATaylor, SE Serotonin transporter inhibitors: synthesis and binding potency of 2'-methyl- and 3'-methyl-6-nitroquipazine. Bioorg Med Chem Lett 10:2643-6 (2000)  
Target
Name:
Sodium-dependent serotonin transporter
Synonyms:
5-HT Transporter 5HT transporter Anandamid membrane transporter, AMT Monoamine transporters; Norepinephrine & serotonin Slc6a4 Sodium-dependent serotonin transporter (SERT) | imipramine receptor
Type:
Multi-pass membrane protein
Mol. Mass.:
70168.43
Organism:
Rattus norvegicus (rat)
Description:
P31652
Residue:
630
  
Inhibitor
Name:
BDBM50063266
Synonyms:
6-Nitro-2-piperazin-1-yl-quinoline CHEMBL41140
Type:
Small organic molecule
Emp. Form.:
C13H14N4O2
Mol. Mass.:
258.2759
SMILES:
[O-][N+](=O)c1ccc2nc(ccc2c1)N1CCNCC1
: