Target
5-hydroxytryptamine receptor 2A
Ligand
BDBM50095034
Substrate
Meas. Tech.
ChEBML_2275
Ki
2.6±n/a nM
Citation
 Stevenson, GISmith, ALLewis, SMichie, SGNeduvelil, JGPatel, SMarwood, RPatel, SCastro, JL 2-Aryl tryptamines: selective high-affinity antagonists for the h5-HT2A receptor. Bioorg Med Chem Lett 10:2697-9 (2000)  
Target
Name:
5-hydroxytryptamine receptor 2A
Synonyms:
5-HT-2 5-HT2A 5-hydroxytryptamine receptor 2A (5HT-2A) 5HT2A_HUMAN HTR2A | Serotonin receptor 2A
Type:
undefined
Mol. Mass.:
52607.65
Organism:
Homo sapiens (Human)
Description:
P28223
Residue:
471
  
Inhibitor
Name:
BDBM50095034
Synonyms:
4-{3-[2-(Ethyl-methyl-amino)-ethyl]-1H-indol-2-yl}-benzonitrile | CHEMBL91542
Type:
Small organic molecule
Emp. Form.:
C20H21N3
Mol. Mass.:
303.4008
SMILES:
CCN(C)CCc1c([nH]c2ccccc12)-c1ccc(cc1)C#N
: