Target
Muscarinic acetylcholine receptor M2
Ligand
BDBM50095106
Substrate
Meas. Tech.
ChEBML_140175
Ki
0.110000±n/a nM
Citation
 Boyle, CDChackalamannil, SChen, LYDugar, SPushpavanam, PBillard, WBinch, HCrosby, GCohen-Williams, MCoffin, VLDuffy, RARuperto, VLachowicz, JE Benzylidene ketal derivatives as M2 muscarinic receptor antagonists. Bioorg Med Chem Lett 10:2727-30 (2000)  
Target
Name:
Muscarinic acetylcholine receptor M2
Synonyms:
ACM2_HUMAN Cholinergic, muscarinic M2 Muscarinic acetylcholine receptor M2 and M5 | RecName: Full=Muscarinic acetylcholine receptor M2
Type:
GPCR
Mol. Mass.:
51730.61
Organism:
Homo sapiens (Human)
Description:
P08172
Residue:
466
  
Inhibitor
Name:
BDBM50095106
Synonyms:
4-{2-[4-(4-Methoxy-benzenesulfonyl)-phenyl]-[1,3]dithiolan-2-yl}-[1,4']bipiperidinyl-1'-carboxylic acid ethyl ester | CHEMBL94247
Type:
Small organic molecule
Emp. Form.:
C29H38N2O5S3
Mol. Mass.:
590.817
SMILES:
CCOC(=O)N1CCC(CC1)N1CCC(CC1)C1(SCCS1)c1ccc(cc1)S(=O)(=O)c1ccc(OC)cc1
: