Target
Stress-70 protein, mitochondrial
Ligand
BDBM50539107
Substrate
Meas. Tech.
ChEMBL_1977650 (CHEMBL4610785)
Kd
700±n/a nM
Citation
 Gnanasekaran, KKPouland, TBunce, RADarrell Berlin, KAbuskhuna, SBhandari, DMashayekhi, MZhou, DHBenbrook, DM Tetrahydroquinoline units in flexible heteroarotinoids (Flex-Hets) convey anti-cancer properties in A2780 ovarian cancer cells. Bioorg Med Chem 28:0 (2020)  
Target
Name:
Stress-70 protein, mitochondrial
Synonyms:
75 kDa glucose-regulated protein GRP75 HSPA9 Heat shock 70 kDa protein 9 Mortalin Peptide-binding protein 74 mt-HSP70
Type:
PROTEIN
Mol. Mass.:
73676.63
Organism:
Homo sapiens
Description:
ChEMBL_118002
Residue:
679
  
Inhibitor
Name:
BDBM50539107
Synonyms:
CHEMBL4639280
Type:
Small organic molecule
Emp. Form.:
C20H25IN4O3
Mol. Mass.:
496.342
SMILES:
[I-].CC1(C)CC[N+](C)(C)c2ccc(NC(=O)Nc3ccc(cc3)[N+]([O-])=O)cc12
: