Target
Stress-70 protein, mitochondrial
Ligand
BDBM50539108
Substrate
Meas. Tech.
ChEMBL_1977650 (CHEMBL4610785)
Kd
300±n/a nM
Citation
 Gnanasekaran, KKPouland, TBunce, RADarrell Berlin, KAbuskhuna, SBhandari, DMashayekhi, MZhou, DHBenbrook, DM Tetrahydroquinoline units in flexible heteroarotinoids (Flex-Hets) convey anti-cancer properties in A2780 ovarian cancer cells. Bioorg Med Chem 28:0 (2020)  
Target
Name:
Stress-70 protein, mitochondrial
Synonyms:
75 kDa glucose-regulated protein GRP75 HSPA9 Heat shock 70 kDa protein 9 Mortalin Peptide-binding protein 74 mt-HSP70
Type:
PROTEIN
Mol. Mass.:
73676.63
Organism:
Homo sapiens
Description:
ChEMBL_118002
Residue:
679
  
Inhibitor
Name:
BDBM50539108
Synonyms:
CHEMBL4649247
Type:
Small organic molecule
Emp. Form.:
C21H24N4O4
Mol. Mass.:
396.4397
SMILES:
CN1c2ccc(NC(=O)Nc3ccc(cc3)[N+]([O-])=O)cc2C(C)(C)C(=O)C1(C)C
: