Target
Ataxin-2
Ligand
BDBM50539260
Substrate
Meas. Tech.
ChEMBL_1977878 (CHEMBL4611013)
IC50
50±n/a nM
Citation
 Gerokonstantis, DTNikolaou, AMagkrioti, CAfantitis, AAidinis, VKokotos, GMoutevelis-Minakakis, P Synthesis of novel 2-pyrrolidinone and pyrrolidine derivatives and study of their inhibitory activity against autotaxin enzyme. Bioorg Med Chem 28:0 (2020)  
Target
Name:
Ataxin-2
Synonyms:
ATX2_MOUSE Atx2 Sca2 | Spinocerebellar ataxia type 2 protein homolog
Type:
PROTEIN
Mol. Mass.:
136544.55
Organism:
Mus musculus
Description:
ChEMBL_119897
Residue:
1285
  
Inhibitor
Name:
BDBM50539260
Synonyms:
CHEMBL4640637
Type:
Small organic molecule
Emp. Form.:
C32H37BN2O5
Mol. Mass.:
540.458
SMILES:
CC1(C)OB(OC1(C)C)c1ccc(COc2ccc(CNC(=O)[C@@H]3CCC(=O)N3Cc3ccccc3)cc2)cc1
: