Target
Adenosine kinase
Ligand
BDBM50095358
Substrate
Meas. Tech.
ChEBML_31129
IC50
470±n/a nM
Citation
 Cowart, MLee, CHGfesser, GABayburt, EKBhagwat, SSStewart, AOYu, HKohlhaas, KLMcGaraughty, SWismer, CTMikusa, JZhu, CAlexander, KMJarvis, MFKowaluk, EA Structure-activity studies of 5-substituted pyridopyrimidines as adenosine kinase inhibitors. Bioorg Med Chem Lett 11:83-6 (2001)  
Target
Name:
Adenosine kinase
Synonyms:
ADENOSINE Adenosine 5-phosphotransferase Adenosine kinase | Adk
Type:
Enzyme
Mol. Mass.:
40130.14
Organism:
Rattus norvegicus (rat)
Description:
Rat brain cytosol as enzyme source.
Residue:
361
  
Inhibitor
Name:
BDBM50095358
Synonyms:
7-(4-Dimethylamino-phenyl)-5-phenyl-pyrido[2,3-d]pyrimidin-4-ylamine | CHEMBL68492
Type:
Small organic molecule
Emp. Form.:
C21H19N5
Mol. Mass.:
341.4091
SMILES:
CN(C)c1ccc(cc1)-c1cc(-c2ccccc2)c2c(N)ncnc2n1
: