Target
Neutrophil elastase
Ligand
BDBM50095523
Substrate
Meas. Tech.
ChEMBL_88197 (CHEMBL699807)
Ki
0.025±n/a nM
Citation
 Ohmoto, KYamamoto, THoriuchi, TImanishi, HOdagaki, YKawabata, KSekioka, THirota, YMatsuoka, SNakai, HToda, MCheronis, JCSpruce, LWGyorkos, AWieczorek, M Design and synthesis of new orally active nonpeptidic inhibitors of human neutrophil elastase. J Med Chem 43:4927-9 (2001)  
Target
Name:
Neutrophil elastase
Synonyms:
Bone marrow serine protease Coagulation factor X ELANE Elastase HLE Leukocyte elastase Medullasin Neutrophil elastase (HNE) PMN elastase Trypsin
Type:
Enzyme
Mol. Mass.:
28532.38
Organism:
Homo sapiens (Human)
Description:
P08246
Residue:
267
  
Inhibitor
Name:
BDBM50095523
Synonyms:
CHEMBL285231 [2-Methyl-1-(2-{2-methyl-1-[5-(3-methyl-benzyl)-[1,3,4]oxadiazole-2-carbonyl]-propylcarbamoyl}-pyrrolidine-1-carbonyl)-propyl]-carbamic acid benzyl ester
Type:
Small organic molecule
Emp. Form.:
C33H41N5O6
Mol. Mass.:
603.7085
SMILES:
CC(C)[C@H](NC(=O)OCc1ccccc1)C(=O)N1CCC[C@H]1C(=O)N[C@@H](C(C)C)C(=O)c1nnc(Cc2cccc(C)c2)o1
: