Target
Adenosine receptor A1
Ligand
BDBM50095604
Substrate
Meas. Tech.
ChEMBL_29606 (CHEMBL640264)
Kd
0.37±n/a nM
Citation
 Beauglehole, ARBaker, SPScammells, PJ Fluorosulfonyl-substituted xanthines as selective irreversible antagonists for the A(1)-adenosine receptor. J Med Chem 43:4973-80 (2001)  
Target
Name:
Adenosine receptor A1
Synonyms:
A1 adenosine receptor (hA1) AA1R_HUMAN ADORA1 Adenosine A1-receptor Adenosine receptor A1 (hA1) | Adenosine transporter (AdT)
Type:
G Protein-Coupled Receptor (GPCR)
Mol. Mass.:
36520.92
Organism:
Homo sapiens (Human)
Description:
P30542
Residue:
326
  
Inhibitor
Name:
BDBM50095604
Synonyms:
4-[3-(8-Cyclohexyl-2,6-dioxo-1-propyl-1,2,6,7-tetrahydro-purin-3-yl)-propylcarbamoyl]-benzenesulfonyl fluoride | CHEMBL144360
Type:
Small organic molecule
Emp. Form.:
C24H30FN5O5S
Mol. Mass.:
519.589
SMILES:
CCCn1c(=O)n(CCCNC(=O)c2ccc(cc2)S(F)(=O)=O)c2nc([nH]c2c1=O)C1CCCCC1
: