Target
Adenosine receptor A2a
Ligand
BDBM50059376
Substrate
Meas. Tech.
ChEMBL_31210 (CHEMBL640306)
IC50
27500±n/a nM
Citation
 Harada, HAsano, OHoshino, YYoshikawa, SMatsukura, MKabasawa, YNiijima, JKotake, YWatanabe, NKawata, TInoue, THorizoe, TYasuda, NMinami, HNagata, KMurakami, MNagaoka, JKobayashi, STanaka, IAbe, S 2-Alkynyl-8-aryl-9-methyladenines as novel adenosine receptor antagonists: their synthesis and structure-activity relationships toward hepatic glucose production induced via agonism of the A(2B) receptor. J Med Chem 44:170-9 (2001)  
Target
Name:
Adenosine receptor A2a
Synonyms:
A2A adenosine receptor (hA2A) ADENOSINE A2 ADORA2 Adenosine A2A receptor (A2AAR)
Type:
G Protein-Coupled Receptor (GPCR)
Mol. Mass.:
44716.46
Organism:
Homo sapiens (Human)
Description:
P29274
Residue:
412
  
Inhibitor
Name:
BDBM50059376
Synonyms:
9-Methyl-2-phenyl-5,9-dihydro-[1,2,4]triazolo[5,1-a][2,7]naphthyridine-6-carboxylic acid methyl ester L-249313
Type:
Small organic molecule
Emp. Form.:
C18H16N4O2
Mol. Mass.:
320.3452
SMILES:
COC(=O)C1=C2C=CN(C)C=C2c2nc(nn2C1)-c1ccccc1
: