Target
Sphingomyelin phosphodiesterase 3
Ligand
BDBM50540358
Substrate
Meas. Tech.
ChEMBL_1981863 (CHEMBL4615125)
IC50
300±n/a nM
Citation
 ?ála, MHollinger, KRThomas, AGDash, RPTallon, CVeeravalli, VLovell, LKögler, MH?ebabecký, HProcházková, ENe?uta, ODonoghue, ALam, JRais, RRojas, CSlusher, BSNencka, R Novel Human Neutral Sphingomyelinase 2 Inhibitors as Potential Therapeutics for Alzheimer's Disease. J Med Chem 63:6028-6056 (2020)  
Target
Name:
Sphingomyelin phosphodiesterase 3
Synonyms:
3.1.4.12 Neutral sphingomyelinase 2 SMPD3 nSMase-2 | nSMase2
Type:
PROTEIN
Mol. Mass.:
71072.54
Organism:
Homo sapiens
Description:
ChEMBL_119220
Residue:
655
  
Inhibitor
Name:
BDBM50540358
Synonyms:
CHEMBL4647138 | US11427590, Entry 38
Type:
Small organic molecule
Emp. Form.:
C27H29N5O4
Mol. Mass.:
487.5503
SMILES:
COc1ccc(cc1OC)-c1c(C)nc2c(cc(C)nn12)N1CC[C@H](C1)NC(=O)Oc1ccccc1
: