Target
Sphingomyelin phosphodiesterase 3
Ligand
BDBM50521419
Substrate
Meas. Tech.
ChEMBL_1981863 (CHEMBL4615125)
IC50
30±n/a nM
Citation
 ?ála, MHollinger, KRThomas, AGDash, RPTallon, CVeeravalli, VLovell, LKögler, MH?ebabecký, HProcházková, ENe?uta, ODonoghue, ALam, JRais, RRojas, CSlusher, BSNencka, R Novel Human Neutral Sphingomyelinase 2 Inhibitors as Potential Therapeutics for Alzheimer's Disease. J Med Chem 63:6028-6056 (2020)  
Target
Name:
Sphingomyelin phosphodiesterase 3
Synonyms:
3.1.4.12 Neutral sphingomyelinase 2 SMPD3 nSMase-2 | nSMase2
Type:
PROTEIN
Mol. Mass.:
71072.54
Organism:
Homo sapiens
Description:
ChEMBL_119220
Residue:
655
  
Inhibitor
Name:
BDBM50521419
Synonyms:
CHEMBL1342201
Type:
Small organic molecule
Emp. Form.:
C21H18N2O3S
Mol. Mass.:
378.444
SMILES:
COc1cc(cc(OC)c1O)-c1nc(c([nH]1)-c1cccs1)-c1ccccc1
: