Target
Muscarinic acetylcholine receptor M4
Ligand
BDBM50540493
Substrate
Meas. Tech.
ChEMBL_1981911 (CHEMBL4615173)
Ki
0.812831±n/a nM
Citation
 Del Bello, FBonifazi, AGiorgioni, GPiergentili, ASabbieti, MGAgas, DDell'Aera, MMatucci, RGórecki, MPescitelli, GVistoli, GQuaglia, W Novel Potent Muscarinic Receptor Antagonists: Investigation on the Nature of Lipophilic Substituents in the 5- and/or 6-Positions of the 1,4-Dioxane Nucleus. J Med Chem 63:5763-5782 (2020)  
Target
Name:
Muscarinic acetylcholine receptor M4
Synonyms:
ACM4_HUMAN Cholinergic, muscarinic M4 Muscarinic acetylcholine receptor M2 and M4
Type:
Enzyme Catalytic Domain
Mol. Mass.:
53079.31
Organism:
Homo sapiens (Human)
Description:
Cholinergic, muscarinic M4 CHRM4 HUMAN M3::P08173
Residue:
479
  
Inhibitor
Name:
BDBM50540493
Synonyms:
CHEMBL4635500
Type:
Small organic molecule
Emp. Form.:
C19H29NO2
Mol. Mass.:
303.4391
SMILES:
CN(C)C[C@H]1COC[C@](O1)(C1CCCCC1)c1ccccc1
: