Target
Prothrombin
Ligand
BDBM50096630
Substrate
Meas. Tech.
ChEBML_32965
Ki
3.2±n/a nM
Citation
 Bachand, BTarazi, MSt-Denis, YEdmunds, JJWinocour, PDLeblond, LSiddiqui, MA Potent and selective bicyclic lactam inhibitors of thrombin. Part 4: transition state inhibitors. Bioorg Med Chem Lett 11:287-90 (2001)  
Target
Name:
Prothrombin
Synonyms:
Activation peptide fragment 1 Coagulation factor II Prothrombin precursor Thrombin heavy chain | Thrombin light chain
Type:
Protein
Mol. Mass.:
70029.57
Organism:
Homo sapiens (Human)
Description:
P00734
Residue:
622
  
Inhibitor
Name:
BDBM50096630
Synonyms:
(6S,8aS)-4-Oxo-2-phenylmethanesulfonyl-octahydro-pyrrolo[1,2-a]pyrazine-6-carboxylic acid [1-(4-amino-cyclohexyl)-2-oxo-2-thiazol-2-yl-ethyl]-amide | CHEMBL3084832
Type:
Small organic molecule
Emp. Form.:
C26H33N5O5S2
Mol. Mass.:
559.701
SMILES:
[H][C@@]12CC[C@H](N1C(=O)CN(C2)S(=O)(=O)Cc1ccccc1)C(=O)NC([C@H]1CC[C@H](N)CC1)C(=O)c1nccs1
: